Reaction Details
TargetCalpain-2 catalytic subunit
LigandBDBM50053799
Substrate/Competitorn/a
Meas. Tech.ChEMBL_43853 (CHEMBL658514)
Ki 280±n/a nM
Citation Li, ZOrtega-Vilain, ACPatil, GSChu, DLForeman, JEEveleth, DDPowers, JC Novel peptidyl alpha-keto amide inhibitors of calpains and other cysteine proteases. J Med Chem39:4089-98 (1996) 
 
Calpain-2 catalytic subunit
Name:Calpain-2 catalytic subunit
Type:Protein
Mol. Mass.:79965.18
Organism:Homo sapiens (Human)
Description:n/a
Residue:700
BDBM50053799
NameBDBM50053799
Synonyms:CHEMBL134092 | [1-(1-{2-Hydroxy-2-[3-(3-trifluoromethyl-phenoxy)-phenyl]-ethylaminooxalyl}-propylcarbamoyl)-3-methyl-butyl]-carbamic acid benzyl ester
TypeSmall organic molecule
Emp. Form.C34H38F3N3O7
Mol. Mass.657.6766
SMILESCCC(NC(=O)C(CC(C)C)NC(=O)OCc1ccccc1)C(=O)C(=O)NCC(O)c1cccc(Oc2cccc(c2)C(F)(F)F)c1