Reaction Details
TargetCalpain-2 catalytic subunit
LigandBDBM50053832
Substrate/Competitorn/a
Meas. Tech.ChEMBL_43853 (CHEMBL658514)
Ki 150±n/a nM
Citation Li, ZOrtega-Vilain, ACPatil, GSChu, DLForeman, JEEveleth, DDPowers, JC Novel peptidyl alpha-keto amide inhibitors of calpains and other cysteine proteases. J Med Chem39:4089-98 (1996) 
 
Calpain-2 catalytic subunit
Name:Calpain-2 catalytic subunit
Type:Protein
Mol. Mass.:79965.18
Organism:Homo sapiens (Human)
Description:n/a
Residue:700
BDBM50053832
NameBDBM50053832
Synonyms:CHEMBL422260 | {1-[1-(Isoquinolin-1-ylmethyl)-aminooxalyl]-propylcarbamoyl}-3-methyl-butyl)-carbamic acid benzyl ester
TypeSmall organic molecule
Emp. Form.C29H34N4O5
Mol. Mass.518.6041
SMILESCCC(NC(=O)C(CC(C)C)NC(=O)OCc1ccccc1)C(=O)C(=O)NCc1nccc2ccccc12