Reaction Details
TargetCathepsin B
LigandBDBM50053807
Substrate/Competitorn/a
Meas. Tech.ChEMBL_47385 (CHEMBL659000)
Ki 1700±n/a nM
Citation Li, ZOrtega-Vilain, ACPatil, GSChu, DLForeman, JEEveleth, DDPowers, JC Novel peptidyl alpha-keto amide inhibitors of calpains and other cysteine proteases. J Med Chem39:4089-98 (1996) 
 
Cathepsin B
Name:Cathepsin B
Type:Enzyme
Mol. Mass.:36657.87
Organism:Bos taurus (bovine)
Description:Bovine spleen CB was purchased from Sigma Co. (USA).
Residue:335
BDBM50053807
NameBDBM50053807
Synonyms:CHEMBL337608 | {3-Methyl-1-[1-(1,3,7-trimethyl-2,6-dioxo-2,3,6,7-tetrahydro-1H-purin-8-ylmethyl)-aminooxalyl]-propylcarbamoyl}-butyl)-carbamic acid benzyl ester
TypeSmall organic molecule
Emp. Form.C28H37N7O7
Mol. Mass.583.6361
SMILESCCC(NC(=O)C(CC(C)C)NC(=O)OCc1ccccc1)C(=O)C(=O)NCc1nc2n(C)c(=O)n(C)c(=O)c2n1C