Reaction Details
TargetCathepsin B
LigandBDBM50053802
Substrate/Competitorn/a
Meas. Tech.ChEMBL_47385 (CHEMBL659000)
Ki 450±n/a nM
Citation Li, ZOrtega-Vilain, ACPatil, GSChu, DLForeman, JEEveleth, DDPowers, JC Novel peptidyl alpha-keto amide inhibitors of calpains and other cysteine proteases. J Med Chem39:4089-98 (1996) 
 
Cathepsin B
Name:Cathepsin B
Type:Enzyme
Mol. Mass.:36657.87
Organism:Bos taurus (bovine)
Description:Bovine spleen CB was purchased from Sigma Co. (USA).
Residue:335
BDBM50053802
NameBDBM50053802
Synonyms:CHEMBL133970 | {3-Methyl-1-[1-(quinolin-2-ylmethyl)-aminooxalyl]-propylcarbamoyl}-butyl)-carbamic acid benzyl ester
TypeSmall organic molecule
Emp. Form.C29H34N4O5
Mol. Mass.518.6041
SMILESCCC(NC(=O)C(CC(C)C)NC(=O)OCc1ccccc1)C(=O)C(=O)NCc1ccc2ccccc2n1