Reaction Details
TargetCalpain-1 catalytic subunit
LigandBDBM50053801
Substrate/Competitorn/a
Meas. Tech.ChEMBL_43668 (CHEMBL656201)
Ki 200±n/a nM
Citation Li, ZOrtega-Vilain, ACPatil, GSChu, DLForeman, JEEveleth, DDPowers, JC Novel peptidyl alpha-keto amide inhibitors of calpains and other cysteine proteases. J Med Chem39:4089-98 (1996) 
 
Calpain-1 catalytic subunit
Name:Calpain-1 catalytic subunit
Type:Protein
Mol. Mass.:81880.51
Organism:Homo sapiens (Human)
Description:n/a
Residue:714
BDBM50053801
NameBDBM50053801
Synonyms:(1-{1-Benzyl-2-[2-hydroxy-2-(4-phenoxy-phenyl)-ethylcarbamoyl]-2-oxo-ethylcarbamoyl}-3-methyl-butyl)-carbamic acid benzyl ester | CHEMBL133936
TypeSmall organic molecule
Emp. Form.C38H41N3O7
Mol. Mass.651.748
SMILESCC(C)CC(NC(=O)OCc1ccccc1)C(=O)NC(Cc1ccccc1)C(=O)C(=O)NCC(O)c1ccc(Oc2ccccc2)cc1