Reaction Details
TargetCathepsin B
LigandBDBM50053820
Substrate/Competitorn/a
Meas. Tech.ChEMBL_47385 (CHEMBL659000)
Ki 72.0±n/a nM
Citation Li, ZOrtega-Vilain, ACPatil, GSChu, DLForeman, JEEveleth, DDPowers, JC Novel peptidyl alpha-keto amide inhibitors of calpains and other cysteine proteases. J Med Chem39:4089-98 (1996) 
 
Cathepsin B
Name:Cathepsin B
Type:Enzyme
Mol. Mass.:36657.87
Organism:Bos taurus (bovine)
Description:Bovine spleen CB was purchased from Sigma Co. (USA).
Residue:335
BDBM50053820
NameBDBM50053820
Synonyms:(1-{1-[2-(4-Dimethylamino-phenyl)-2-hydroxy-ethylaminooxalyl]-propylcarbamoyl}-3-methyl-butyl)-carbamic acid benzyl ester | CHEMBL130122
TypeSmall organic molecule
Emp. Form.C29H40N4O6
Mol. Mass.540.6511
SMILESCCC(NC(=O)C(CC(C)C)NC(=O)OCc1ccccc1)C(=O)C(=O)NCC(O)c1ccc(cc1)N(C)C