Reaction Details
TargetCathepsin B
LigandBDBM50053823
Substrate/Competitorn/a
Meas. Tech.ChEMBL_47385 (CHEMBL659000)
Ki 220±n/a nM
Citation Li, ZOrtega-Vilain, ACPatil, GSChu, DLForeman, JEEveleth, DDPowers, JC Novel peptidyl alpha-keto amide inhibitors of calpains and other cysteine proteases. J Med Chem39:4089-98 (1996) 
 
Cathepsin B
Name:Cathepsin B
Type:Enzyme
Mol. Mass.:36657.87
Organism:Bos taurus (bovine)
Description:Bovine spleen CB was purchased from Sigma Co. (USA).
Residue:335
BDBM50053823
NameBDBM50053823
Synonyms:CHEMBL130580 | Isoquinoline-1-carboxylic acid [1-(1-ethylaminooxalyl-propylcarbamoyl)-3-methyl-butyl]-amide
TypeSmall organic molecule
Emp. Form.C23H30N4O4
Mol. Mass.426.5087
SMILESCCNC(=O)C(=O)C(CC)NC(=O)C(CC(C)C)NC(=O)c1nccc2ccccc12