Reaction Details
TargetCathepsin B
LigandBDBM50053817
Substrate/Competitorn/a
Meas. Tech.ChEMBL_47427 (CHEMBL662614)
Ki 310±n/a nM
Citation Li, ZOrtega-Vilain, ACPatil, GSChu, DLForeman, JEEveleth, DDPowers, JC Novel peptidyl alpha-keto amide inhibitors of calpains and other cysteine proteases. J Med Chem39:4089-98 (1996) 
 
Cathepsin B
Name:Cathepsin B
Type:Enzyme
Mol. Mass.:37819.69
Organism:Homo sapiens (Human)
Description:gi_63102437
Residue:339
BDBM50053817
NameBDBM50053817
Synonyms:(1-{1-[2-(3-Methoxy-phenyl)-ethylaminooxalyl]-propylcarbamoyl}-3-methyl-butyl)-carbamic acid benzyl ester | CHEMBL130338
TypeSmall organic molecule
Emp. Form.C28H37N3O6
Mol. Mass.511.6099
SMILESCCC(NC(=O)C(CC(C)C)NC(=O)OCc1ccccc1)C(=O)C(=O)NCCc1cccc(OC)c1