Reaction Details
TargetCathepsin B
LigandBDBM50053832
Substrate/Competitorn/a
Meas. Tech.ChEMBL_47427 (CHEMBL662614)
Ki 300±n/a nM
Citation Li, ZOrtega-Vilain, ACPatil, GSChu, DLForeman, JEEveleth, DDPowers, JC Novel peptidyl alpha-keto amide inhibitors of calpains and other cysteine proteases. J Med Chem39:4089-98 (1996) 
 
Cathepsin B
Name:Cathepsin B
Type:Enzyme
Mol. Mass.:37819.69
Organism:Homo sapiens (Human)
Description:gi_63102437
Residue:339
BDBM50053832
NameBDBM50053832
Synonyms:CHEMBL422260 | {1-[1-(Isoquinolin-1-ylmethyl)-aminooxalyl]-propylcarbamoyl}-3-methyl-butyl)-carbamic acid benzyl ester
TypeSmall organic molecule
Emp. Form.C29H34N4O5
Mol. Mass.518.6041
SMILESCCC(NC(=O)C(CC(C)C)NC(=O)OCc1ccccc1)C(=O)C(=O)NCc1nccc2ccccc12