Reaction Details
TargetCathepsin B
LigandBDBM50053850
Substrate/Competitorn/a
Meas. Tech.ChEMBL_47427 (CHEMBL662614)
Ki 370±n/a nM
Citation Li, ZOrtega-Vilain, ACPatil, GSChu, DLForeman, JEEveleth, DDPowers, JC Novel peptidyl alpha-keto amide inhibitors of calpains and other cysteine proteases. J Med Chem39:4089-98 (1996) 
 
Cathepsin B
Name:Cathepsin B
Type:Enzyme
Mol. Mass.:37819.69
Organism:Homo sapiens (Human)
Description:gi_63102437
Residue:339
BDBM50053850
NameBDBM50053850
Synonyms:CHEMBL130506 | {1-[1-(2-Hydroxy-2-phenyl-ethylaminooxalyl)-propylcarbamoyl]-3-methyl-butyl}-carbamic acid benzyl ester
TypeSmall organic molecule
Emp. Form.C27H35N3O6
Mol. Mass.497.5833
SMILESCCC(NC(=O)C(CC(C)C)NC(=O)OCc1ccccc1)C(=O)C(=O)NCC(O)c1ccccc1