Reaction Details
TargetCathepsin B
LigandBDBM50053853
Substrate/Competitorn/a
Meas. Tech.ChEMBL_47385 (CHEMBL659000)
Ki 550±n/a nM
Citation Li, ZOrtega-Vilain, ACPatil, GSChu, DLForeman, JEEveleth, DDPowers, JC Novel peptidyl alpha-keto amide inhibitors of calpains and other cysteine proteases. J Med Chem39:4089-98 (1996) 
 
Cathepsin B
Name:Cathepsin B
Type:Enzyme
Mol. Mass.:36657.87
Organism:Bos taurus (bovine)
Description:Bovine spleen CB was purchased from Sigma Co. (USA).
Residue:335
BDBM50053853
NameBDBM50053853
Synonyms:3-(2-Diphenylacetylamino-4-methyl-pentanoylamino)-2-oxo-pentanoic acid ethylamide | CHEMBL131779
TypeSmall organic molecule
Emp. Form.C27H35N3O4
Mol. Mass.465.5845
SMILESCCNC(=O)C(=O)C(CC)NC(=O)C(CC(C)C)NC(=O)C(c1ccccc1)c1ccccc1