Reaction Details
TargetCathepsin B
LigandBDBM50053859
Substrate/Competitorn/a
Meas. Tech.ChEMBL_47427 (CHEMBL662614)
Ki 280±n/a nM
Citation Li, ZOrtega-Vilain, ACPatil, GSChu, DLForeman, JEEveleth, DDPowers, JC Novel peptidyl alpha-keto amide inhibitors of calpains and other cysteine proteases. J Med Chem39:4089-98 (1996) 
 
Cathepsin B
Name:Cathepsin B
Type:Enzyme
Mol. Mass.:37819.69
Organism:Homo sapiens (Human)
Description:gi_63102437
Residue:339
BDBM50053859
NameBDBM50053859
Synonyms:CHEMBL133106 | {1-[1-(5-Hydroxy-pentylaminooxalyl)-propylcarbamoyl]-3-methyl-butyl}-carbamic acid benzyl ester
TypeSmall organic molecule
Emp. Form.C24H37N3O6
Mol. Mass.463.5671
SMILESCCC(NC(=O)C(CC(C)C)NC(=O)OCc1ccccc1)C(=O)C(=O)NCCCCCO