Reaction Details
TargetCalpain-1 catalytic subunit
LigandBDBM50053856
Substrate/Competitorn/a
Meas. Tech.ChEMBL_43668 (CHEMBL656201)
Ki 420±n/a nM
Citation Li, ZOrtega-Vilain, ACPatil, GSChu, DLForeman, JEEveleth, DDPowers, JC Novel peptidyl alpha-keto amide inhibitors of calpains and other cysteine proteases. J Med Chem39:4089-98 (1996) 
 
Calpain-1 catalytic subunit
Name:Calpain-1 catalytic subunit
Type:Protein
Mol. Mass.:81880.51
Organism:Homo sapiens (Human)
Description:n/a
Residue:714
BDBM50053856
NameBDBM50053856
Synonyms:CHEMBL131781 | {1-[1-(5-Hydroxy-1,3,3-trimethyl-cyclohexylmethyl)-aminooxalyl]-propylcarbamoyl}-3-methyl-butyl)-carbamic acid benzyl ester
TypeSmall organic molecule
Emp. Form.C29H45N3O6
Mol. Mass.531.6841
SMILESCCC(NC(=O)C(CC(C)C)NC(=O)OCc1ccccc1)C(=O)C(=O)NCC1(C)CC(O)CC(C)(C)C1