Reaction Details
TargetCalpain-1 catalytic subunit
LigandBDBM50053806
Substrate/Competitorn/a
Meas. Tech.ChEMBL_43668 (CHEMBL656201)
Ki 50.0±n/a nM
Citation Li, ZOrtega-Vilain, ACPatil, GSChu, DLForeman, JEEveleth, DDPowers, JC Novel peptidyl alpha-keto amide inhibitors of calpains and other cysteine proteases. J Med Chem39:4089-98 (1996) 
 
Calpain-1 catalytic subunit
Name:Calpain-1 catalytic subunit
Type:Protein
Mol. Mass.:81880.51
Organism:Homo sapiens (Human)
Description:n/a
Residue:714
BDBM50053806
NameBDBM50053806
Synonyms:CHEMBL129831 | {1-[1-(2-Hydroxy-2-pentafluorophenyl-ethylaminooxalyl)-propylcarbamoyl]-3-methyl-butyl}-carbamic acid benzyl ester
TypeSmall organic molecule
Emp. Form.C27H30F5N3O6
Mol. Mass.587.5356
SMILESCCC(NC(=O)C(CC(C)C)NC(=O)OCc1ccccc1)C(=O)C(=O)NCC(O)c1c(F)c(F)c(F)c(F)c1F