Reaction Details
TargetCathepsin B
LigandBDBM50053791
Substrate/Competitorn/a
Meas. Tech.ChEMBL_47385 (CHEMBL659000)
Ki 230±n/a nM
Citation Li, ZOrtega-Vilain, ACPatil, GSChu, DLForeman, JEEveleth, DDPowers, JC Novel peptidyl alpha-keto amide inhibitors of calpains and other cysteine proteases. J Med Chem39:4089-98 (1996) 
 
Cathepsin B
Name:Cathepsin B
Type:Enzyme
Mol. Mass.:36657.87
Organism:Bos taurus (bovine)
Description:Bovine spleen CB was purchased from Sigma Co. (USA).
Residue:335
BDBM50053791
NameBDBM50053791
Synonyms:CHEMBL132566 | [1-(1-Benzyl-2-oxo-2-{2-[5-((3aR,6S,6aS)-2-oxo-hexahydro-thieno[3,4-d]imidazol-6-yl)-pentanoylamino]-ethylcarbamoyl}-ethylcarbamoyl)-3-methyl-butyl]-carbamic acid benzyl ester
TypeSmall organic molecule
Emp. Form.C36H48N6O7S
Mol. Mass.708.867
SMILESCC(C)CC(NC(=O)OCc1ccccc1)C(=O)NC(Cc1ccccc1)C(=O)C(=O)NCCNC(=O)CCCC[C@@H]1SC[C@@H]2NC(=O)N[C@H]12