Reaction Details
TargetCalpain-1 catalytic subunit
LigandBDBM50053802
Substrate/Competitorn/a
Meas. Tech.ChEMBL_43668 (CHEMBL656201)
Ki 130±n/a nM
Citation Li, ZOrtega-Vilain, ACPatil, GSChu, DLForeman, JEEveleth, DDPowers, JC Novel peptidyl alpha-keto amide inhibitors of calpains and other cysteine proteases. J Med Chem39:4089-98 (1996) 
 
Calpain-1 catalytic subunit
Name:Calpain-1 catalytic subunit
Type:Protein
Mol. Mass.:81880.51
Organism:Homo sapiens (Human)
Description:n/a
Residue:714
BDBM50053802
NameBDBM50053802
Synonyms:CHEMBL133970 | {3-Methyl-1-[1-(quinolin-2-ylmethyl)-aminooxalyl]-propylcarbamoyl}-butyl)-carbamic acid benzyl ester
TypeSmall organic molecule
Emp. Form.C29H34N4O5
Mol. Mass.518.6041
SMILESCCC(NC(=O)C(CC(C)C)NC(=O)OCc1ccccc1)C(=O)C(=O)NCc1ccc2ccccc2n1