Reaction Details
TargetVoltage-dependent L-type calcium channel subunit alpha-1S
LigandBDBM50053871
Substrate/Competitorn/a
Meas. Tech.ChEMBL_92776 (CHEMBL700076)
Ki 90±n/a nM
Citation Dhainaut, ARegnier, GTizot, APierre, ALeonce, SGuilbaud, NKraus-Berthier, LAtassi, G New purines and purine analogs as modulators of multidrug resistance. J Med Chem39:4099-108 (1996) 
 
Voltage-dependent L-type calcium channel subunit alpha-1S
Name:Voltage-dependent L-type calcium channel subunit alpha-1S
Type:PROTEIN
Mol. Mass.:210392.58
Organism:Rattus norvegicus
Description:ChEMBL_92777
Residue:1850
BDBM50053871
NameBDBM50053871
Synonyms:Allyl-(9-allyl-6-{4-[(5H-dibenzo[a,d]cyclohepten-5-ylmethyl)-amino]-piperidin-1-yl}-9H-purin-2-yl)-amine | CHEMBL132000
TypeSmall organic molecule
Emp. Form.C32H35N7
Mol. Mass.517.6672
SMILESC=CCNc1nc(N2CCC(CC2)NCC2c3ccccc3C=Cc3ccccc23)c2ncn(CC=C)c2n1