Reaction Details
TargetVoltage-dependent L-type calcium channel subunit alpha-1S
LigandBDBM50053874
Substrate/Competitorn/a
Meas. Tech.ChEMBL_92776 (CHEMBL700076)
Ki 410±n/a nM
Citation Dhainaut, ARegnier, GTizot, APierre, ALeonce, SGuilbaud, NKraus-Berthier, LAtassi, G New purines and purine analogs as modulators of multidrug resistance. J Med Chem39:4099-108 (1996) 
 
Voltage-dependent L-type calcium channel subunit alpha-1S
Name:Voltage-dependent L-type calcium channel subunit alpha-1S
Type:PROTEIN
Mol. Mass.:210392.58
Organism:Rattus norvegicus
Description:ChEMBL_92777
Residue:1850
BDBM50053874
NameBDBM50053874
Synonyms:Allyl-{9-allyl-2-[4-(2,2,2-triphenyl-ethylamino)-piperidin-1-yl]-9H-purin-6-yl}-amine | CHEMBL336350
TypeSmall organic molecule
Emp. Form.C36H39N7
Mol. Mass.569.7418
SMILESC=CCNc1nc(nc2n(CC=C)cnc12)N1CCC(CC1)NCC(c1ccccc1)(c1ccccc1)c1ccccc1