Reaction Details
TargetVoltage-dependent L-type calcium channel subunit alpha-1S
LigandBDBM50053873
Substrate/Competitorn/a
Meas. Tech.ChEMBL_92776 (CHEMBL700076)
Ki 12±n/a nM
Citation Dhainaut, ARegnier, GTizot, APierre, ALeonce, SGuilbaud, NKraus-Berthier, LAtassi, G New purines and purine analogs as modulators of multidrug resistance. J Med Chem39:4099-108 (1996) 
 
Voltage-dependent L-type calcium channel subunit alpha-1S
Name:Voltage-dependent L-type calcium channel subunit alpha-1S
Type:PROTEIN
Mol. Mass.:210392.58
Organism:Rattus norvegicus
Description:ChEMBL_92777
Residue:1850
BDBM50053873
NameBDBM50053873
Synonyms:Allyl-(9-allyl-2-{4-[(2-methoxy-10,11-dihydro-5H-dibenzo[a,d]cyclohepten-5-ylmethyl)-amino]-piperidin-1-yl}-9H-purin-6-yl)-amine | CHEMBL334400
TypeSmall organic molecule
Emp. Form.C33H39N7O
Mol. Mass.549.7091
SMILESCOc1ccc2C(CNC3CCN(CC3)c3nc(NCC=C)c4ncn(CC=C)c4n3)c3ccccc3CCc2c1