Reaction Details
TargetVoltage-dependent L-type calcium channel subunit alpha-1S
LigandBDBM50053891
Substrate/Competitorn/a
Meas. Tech.ChEMBL_92776 (CHEMBL700076)
Ki 84±n/a nM
Citation Dhainaut, ARegnier, GTizot, APierre, ALeonce, SGuilbaud, NKraus-Berthier, LAtassi, G New purines and purine analogs as modulators of multidrug resistance. J Med Chem39:4099-108 (1996) 
 
Voltage-dependent L-type calcium channel subunit alpha-1S
Name:Voltage-dependent L-type calcium channel subunit alpha-1S
Type:PROTEIN
Mol. Mass.:210392.58
Organism:Rattus norvegicus
Description:ChEMBL_92777
Residue:1850
BDBM50053891
NameBDBM50053891
Synonyms:(9-Allyl-2-{4-[(10,11-dihydro-5H-dibenzo[a,d]cyclohepten-5-ylmethyl)-amino]-piperidin-1-yl}-9H-purin-6-yl)-propyl-amine | CHEMBL336375
TypeSmall organic molecule
Emp. Form.C32H39N7
Mol. Mass.521.699
SMILESCCCNc1nc(nc2n(CC=C)cnc12)N1CCC(CC1)NCC1c2ccccc2CCc2ccccc12