Reaction Details
TargetAdenosine receptor A3
LigandBDBM50053929
Substrate/Competitorn/a
Meas. Tech.ChEMBL_31845 (CHEMBL641522)
Ki 0.65±n/a nM
Citation Kim, YCJi, XDJacobson, KA Derivatives of the triazoloquinazoline adenosine antagonist (CGS15943) are selective for the human A3 receptor subtype. J Med Chem39:4142-8 (1996) 
 
Adenosine receptor A3
Name:Adenosine receptor A3
Type:G Protein-Coupled Receptor (GPCR)
Mol. Mass.:36197.32
Organism:Homo sapiens (Human)
Description:P0DMS8
Residue:318
BDBM50053929
NameBDBM50053929
Synonyms:CHEMBL88147 N-(9-Chloro-2-furan-2-yl-[1,2,4]triazolo[1,5-c]quinazolin-5-yl)-N-methyl-2-phenyl-acetamide | N-(9-chloro-2-(furan-2-yl)-[1,2,4]triazolo[1,5-c]quinazolin-5-yl)-2-phenylacetamide
TypeSmall organic molecule
Emp. Form.C21H14ClN5O2
Mol. Mass.403.821
SMILESClc1ccc2nc(NC(=O)Cc3ccccc3)n3nc(nc3c2c1)-c1ccco1