Reaction Details
TargetAdenosine receptor A2a
LigandBDBM50004566
Substrate/Competitorn/a
Meas. Tech.ChEMBL_30751 (CHEMBL649782)
Ki 1.7±n/a nM
Citation Kim, YCJi, XDJacobson, KA Derivatives of the triazoloquinazoline adenosine antagonist (CGS15943) are selective for the human A3 receptor subtype. J Med Chem39:4142-8 (1996) 
 
Adenosine receptor A2a
Name:Adenosine receptor A2a
Type:G Protein-Coupled Receptor (GPCR)
Mol. Mass.:44716.46
Organism:Homo sapiens (Human)
Description:P29274
Residue:412
BDBM50004566
NameBDBM50004566
Synonyms:9-Chloro-2-furan-2-yl-[1,2,4]triazolo[1,5-c]quinazolin-5-ylamine 9-Chloro-[1,2,4]triazolo[1,5-c]quinazolin-5-ylamine(CGS 15943) 9-chloro-2-(furan-2-yl)-[1,2,4]triazolo[1,5-c]quinazolin-5-amine CHEMBL16687 Nonnucleoside analog, 4
TypeSmall organic molecule
Emp. Form.C13H8ClN5O
Mol. Mass.285.689
SMILESNc1nc2ccc(Cl)cc2c2nc(nn12)-c1ccco1