Reaction Details
TargetAdenosine receptor A1
LigandBDBM50053944
Substrate/Competitorn/a
Meas. Tech.ChEMBL_29459 (CHEMBL642188)
Ki 1.56±n/a nM
Citation Poulsen, SAQuinn, RJ Synthesis and structure-activity relationship of pyrazolo[3,4-d]pyrimidines: potent and selective adenosine A1 receptor antagonists. J Med Chem39:4156-61 (1996) 
 
Adenosine receptor A1
Name:Adenosine receptor A1
Type:Protein
Mol. Mass.:36704.13
Organism:Rattus norvegicus (rat)
Description:n/a
Residue:326
BDBM50053944
NameBDBM50053944
Synonyms:2-(4-Amino-1-phenyl-1H-pyrazolo[3,4-d]pyrimidin-6-ylsulfanyl)-butyramide | CHEMBL133103
TypeSmall organic molecule
Emp. Form.C15H16N6OS
Mol. Mass.328.392
SMILESCCC(Sc1nc(N)c2cnn(-c3ccccc3)c2n1)C(N)=O