Reaction Details
TargetAdenosine receptor A1
LigandBDBM50053947
Substrate/Competitorn/a
Meas. Tech.ChEMBL_29459 (CHEMBL642188)
Ki 0.745±n/a nM
Citation Poulsen, SAQuinn, RJ Synthesis and structure-activity relationship of pyrazolo[3,4-d]pyrimidines: potent and selective adenosine A1 receptor antagonists. J Med Chem39:4156-61 (1996) 
 
Adenosine receptor A1
Name:Adenosine receptor A1
Type:Protein
Mol. Mass.:36704.13
Organism:Rattus norvegicus (rat)
Description:n/a
Residue:326
BDBM50053947
NameBDBM50053947
Synonyms:2-(4-Methylamino-1-phenyl-1H-pyrazolo[3,4-d]pyrimidin-6-ylsulfanyl)-hexanoic acid amide | CHEMBL60962
TypeSmall organic molecule
Emp. Form.C18H22N6OS
Mol. Mass.370.472
SMILESCCCCC(Sc1nc(NC)c2cnn(-c3ccccc3)c2n1)C(N)=O