Reaction Details
TargetTranslocator protein
LigandBDBM50054125
Substrate/Competitorn/a
Meas. Tech.ChEMBL_39464 (CHEMBL653039)
IC50 1.7±n/a nM
Citation Anzini, MCappelli, AVomero, SGiorgi, GLanger, TBruni, GRomeo, MRBasile, AS Molecular basis of peripheral vs central benzodiazepine receptor selectivity in a new class of peripheral benzodiazepine receptor ligands related to alpidem. J Med Chem39:4275-84 (1996) 
 
Translocator protein
Name:Translocator protein
Type:Mitochondrion membrane protein
Mol. Mass.:18945.84
Organism:Rattus norvegicus (rat)
Description:Competitive binding experiments were performed on rat kidney mitochondrial membranes.
Residue:169
BDBM50054125
NameBDBM50054125
Synonyms:(E)-2-(2-(4-chlorophenyl)-1,2-dihydro-1-oxo-3H-pyrrolo[3,4-b]quinolin-3-ylidene-N-(4-metoxyphenyl)-N-methylacetamide CHEMBL135870
TypeSmall organic molecule
Emp. Form.C27H20ClN3O3
Mol. Mass.469.919
SMILESCOc1ccc(cc1)N(C)C(=O)\C=C1\N(C(=O)c2cc3ccccc3nc12)c1ccc(Cl)cc1