Reaction Details
TargetTranslocator protein
LigandBDBM22032
Substrate/Competitorn/a
Meas. Tech.ChEMBL_39466 (CHEMBL653041)
IC50 1.8±n/a nM
Citation Anzini, MCappelli, AVomero, SGiorgi, GLanger, TBruni, GRomeo, MRBasile, AS Molecular basis of peripheral vs central benzodiazepine receptor selectivity in a new class of peripheral benzodiazepine receptor ligands related to alpidem. J Med Chem39:4275-84 (1996) 
 
Translocator protein
Name:Translocator protein
Type:Mitochondrion membrane protein
Mol. Mass.:18945.84
Organism:Rattus norvegicus (rat)
Description:Competitive binding experiments were performed on rat kidney mitochondrial membranes.
Residue:169
BDBM22032
NameBDBM22032
Synonyms:1-(2-chlorophenyl)-N-methyl-N-(1-methylpropyl)isoquinoline-3-carboxamide N-(butan-2-yl)-1-(2-chlorophenyl)-N-methylisoquinoline-3-carboxamide PK-11195 RP 52028 | [3H]PK 11195
Typeradiolabeled ligand
Emp. Form.C21H21ClN2O
Mol. Mass.352.857
SMILESCCC(C)N(C)C(=O)c1cc2ccccc2c(n1)-c1ccccc1Cl