Reaction Details
TargetGag-Pol polyprotein [489-587]
LigandBDBM50054159
Substrate/Competitorn/a
Meas. Tech.ChEMBL_160748 (CHEMBL769062)
Ki 0.01±n/a nM
Citation Wilkerson, WWAkamike, ECheatham, WWHollis, AYCollins, RDDeLucca, ILam, PYRu, Y HIV protease inhibitory bis-benzamide cyclic ureas: a quantitative structure-activity relationship analysis. J Med Chem39:4299-312 (1996) 
 
Gag-Pol polyprotein [489-587]
Name:Gag-Pol polyprotein [489-587]
Type:Enzyme Subunit
Mol. Mass.:10781.16
Organism:Human immunodeficiency virus type 1
Description:P04585[489-587]
Residue:99
BDBM50054159
NameBDBM50054159
Synonyms:5-chloro-2-{3-[4,7-dibenzyl-3-[3-(5-chloro-2-pyridylcarbamoyl)benzyl]-5,6-dihydroxy-2-oxo-(4R,5S,6S,7R)-1,3-diazepan-1-ylmethyl]phenylcarboxamido}pyridine | CHEMBL405187
TypeSmall organic molecule
Emp. Form.C45H40Cl2N6O5
Mol. Mass.815.742
SMILESO[C@@H]1[C@@H](O)[C@@H](Cc2ccccc2)N(Cc2cccc(c2)C(=O)Nc2ccc(Cl)cn2)C(=O)N(Cc2cccc(c2)C(=O)Nc2ccc(Cl)cn2)[C@@H]1Cc1ccccc1