Reaction Details
TargetGag-Pol polyprotein [489-587]
LigandBDBM154
Substrate/Competitorn/a
Meas. Tech.ChEMBL_160750 (CHEMBL769064)
Ki 0.027±n/a nM
Citation Wilkerson, WWAkamike, ECheatham, WWHollis, AYCollins, RDDeLucca, ILam, PYRu, Y HIV protease inhibitory bis-benzamide cyclic ureas: a quantitative structure-activity relationship analysis. J Med Chem39:4299-312 (1996) 
 
Gag-Pol polyprotein [489-587]
Name:Gag-Pol polyprotein [489-587]
Type:Enzyme Subunit
Mol. Mass.:10781.16
Organism:Human immunodeficiency virus type 1
Description:P04585[489-587]
Residue:99
BDBM154
NameBDBM154
Synonyms:3-{[(4R,5S,6S,7R)-4,7-dibenzyl-5,6-dihydroxy-2-oxo-3-{[3-(1,3-thiazol-2-ylcarbamoyl)phenyl]methyl}-1,3-diazepan-1-yl]methyl}-N-(1,3-thiazol-2-yl)benzamide XV638
Typen/a
Emp. Form.C41H38N6O5S2
Mol. Mass.758.908
SMILESO[C@@H]1[C@@H](O)[C@@H](Cc2ccccc2)N(Cc2cccc(c2)C(=O)Nc2nccs2)C(=O)N(Cc2cccc(c2)C(=O)Nc2nccs2)[C@@H]1Cc1ccccc1