Reaction Details
TargetGag-Pol polyprotein [489-587]
LigandBDBM157
Substrate/Competitorn/a
Meas. Tech.ChEMBL_160748 (CHEMBL769062)
Ki 0.06±n/a nM
Citation Wilkerson, WWAkamike, ECheatham, WWHollis, AYCollins, RDDeLucca, ILam, PYRu, Y HIV protease inhibitory bis-benzamide cyclic ureas: a quantitative structure-activity relationship analysis. J Med Chem39:4299-312 (1996) 
 
Gag-Pol polyprotein [489-587]
Name:Gag-Pol polyprotein [489-587]
Type:Enzyme Subunit
Mol. Mass.:10781.16
Organism:Human immunodeficiency virus type 1
Description:P04585[489-587]
Residue:99
BDBM157
NameBDBM157
Synonyms:3-{[(4R,5S,6S,7R)-4,7-dibenzyl-5,6-dihydroxy-3-{[3-(methylcarbamoyl)phenyl]methyl}-2-oxo-1,3-diazepan-1-yl]methyl}-N-methylbenzamide Cyclic Urea
Typen/a
Emp. Form.C37H40N4O5
Mol. Mass.620.7373
SMILESCNC(=O)c1cccc(CN2[C@H](Cc3ccccc3)[C@H](O)[C@@H](O)[C@@H](Cc3ccccc3)N(Cc3cccc(c3)C(=O)NC)C2=O)c1