Reaction Details
TargetCorticotropin-releasing factor receptor 1
LigandBDBM50054248
Substrate/Competitorn/a
Meas. Tech.ChEMBL_51122 (CHEMBL665735)
Ki 2.5±n/a nM
Citation Chen, CDagnino, RDe Souza, EBGrigoriadis, DEHuang, CQKim, KILiu, ZMoran, TWebb, TRWhitten, JPXie, YFMcCarthy, JR Design and synthesis of a series of non-peptide high-affinity human corticotropin-releasing factor1 receptor antagonists. J Med Chem39:4358-60 (1996) 
 
Corticotropin-releasing factor receptor 1
Name:Corticotropin-releasing factor receptor 1
Type:Enzyme
Mol. Mass.:50744.31
Organism:Homo sapiens (Human)
Description:P34998
Residue:444
BDBM50054248
NameBDBM50054248
Synonyms:2,5-Dimethyl-N,N-dipropyl-N'-(2,4,6-trichloro-phenyl)-pyrimidine-4,6-diamine | CHEMBL75859
TypeSmall organic molecule
Emp. Form.C18H23Cl3N4
Mol. Mass.401.761
SMILESCCCN(CCC)c1nc(C)nc(Nc2c(Cl)cc(Cl)cc2Cl)c1C