Reaction Details
TargetD(3) dopamine receptor
LigandBDBM50054342
Substrate/Competitorn/a
Meas. Tech.ChEMBL_62275 (CHEMBL674410)
Ki 0.251±n/a nM
Citation Malmberg, AHöök, BBJohansson, AMHacksell, U Novel (R)-2-amino-5-fluorotetralins: dopaminergic antagonists and inverse agonists. J Med Chem39:4421-9 (1996) 
 
D(3) dopamine receptor
Name:D(3) dopamine receptor
Type:n/a
Mol. Mass.:44243.43
Organism:Homo sapiens (Human)
Description:n/a
Residue:400
BDBM50054342
NameBDBM50054342
Synonyms:8-{4-[((R)-5-Fluoro-1,2,3,4-tetrahydro-naphthalen-2-yl)-propyl-amino]-butyl}-8-aza-spiro[4.5]decane-7,9-dione | CHEMBL138998
TypeSmall organic molecule
Emp. Form.C26H37FN2O2
Mol. Mass.428.5826
SMILESCCCN(CCCCN1C(=O)CC2(CCCC2)CC1=O)[C@@H]1CCc2c(F)cccc2C1