Reaction Details
Target5-hydroxytryptamine receptor 1A
LigandBDBM50054393
Substrate/Competitorn/a
Meas. Tech.ChEMBL_1163 (CHEMBL616108)
Ki 2.4±n/a nM
Citation López-Rodríguez, MLRosado, MLBenhamú, BMorcillo, MJSanz, AMOrensanz, LBeneitez, MEFuentes, JAManzanares, J Synthesis and structure-activity relationships of a new model of arylpiperazines. 1. 2-[[4-(o-methoxyphenyl)piperazin-1-yl]methyl]-1, 3-dioxoperhydroimidazo[1,5-alpha]pyridine: a selective 5-HT1A receptor agonist. J Med Chem39:4439-50 (1996) 
 
5-hydroxytryptamine receptor 1A
Name:5-hydroxytryptamine receptor 1A
Type:G Protein-Coupled Receptor (GPCR)
Mol. Mass.:46445.29
Organism:Rattus norvegicus (rat)
Description:Binding assays were performed using rat hippocampal membranes.
Residue:422
BDBM50054393
NameBDBM50054393
Synonyms:2-{4-[4-(3-Trifluoromethyl-phenyl)-piperazin-1-yl]-butyl}-tetrahydro-pyrrolo[1,2-c]imidazole-1,3-dione | CHEMBL46918
TypeSmall organic molecule
Emp. Form.C21H27F3N4O2
Mol. Mass.424.4599
SMILESOc1c2CCCn2c(=O)n1CCCCN1CCN(CC1)c1cccc(c1)C(F)(F)F