Reaction Details
TargetKappa-type opioid receptor
LigandBDBM50054440
Substrate/Competitorn/a
Meas. Tech.ChEMBL_146659 (CHEMBL753556)
Ki 1.2±n/a nM
Citation Chang, ACCowan, ATakemori, AEPortoghese, PS Aspartic acid conjugates of 2-(3,4-dichlorophenyl)-N-methyl-N-[(1S)-1(3-aminophenyl)-2-(1-pyrrolidi nyl) ethyl]acetamide: kappa opioid receptor agonists with limited access to the central nervous system. J Med Chem39:4478-82 (1996) 
 
Kappa-type opioid receptor
Name:Kappa-type opioid receptor
Type:G Protein-Coupled Receptor (GPCR)
Mol. Mass.:42744.99
Organism:Cavia porcellus (domestic guinea pig)
Description:P41144
Residue:380
BDBM50054440
NameBDBM50054440
Synonyms:(R)-3-Amino-N-[3-((S)-1-{[2-(3,4-dichloro-phenyl)-acetyl]-methyl-amino}-2-pyrrolidin-1-yl-ethyl)-phenyl]-succinamic acid | CHEMBL344885
TypeSmall organic molecule
Emp. Form.C25H30Cl2N4O4
Mol. Mass.521.436
SMILESCN([C@H](CN1CCCC1)c1cccc(NC(=O)[C@H](N)CC(O)=O)c1)C(=O)Cc1ccc(Cl)c(Cl)c1