Reaction Details
TargetMu-type opioid receptor
LigandBDBM50054439
Substrate/Competitorn/a
Meas. Tech.ChEMBL_145294 (CHEMBL752188)
Ki 462±n/a nM
Citation Chang, ACCowan, ATakemori, AEPortoghese, PS Aspartic acid conjugates of 2-(3,4-dichlorophenyl)-N-methyl-N-[(1S)-1(3-aminophenyl)-2-(1-pyrrolidi nyl) ethyl]acetamide: kappa opioid receptor agonists with limited access to the central nervous system. J Med Chem39:4478-82 (1996) 
 
Mu-type opioid receptor
Name:Mu-type opioid receptor
Type:Enzyme Catalytic Domain
Mol. Mass.:11165.58
Organism:GUINEA PIG
Description:P97266
Residue:98
BDBM50054439
NameBDBM50054439
Synonyms:(S)-3-Amino-N-[3-((S)-1-{[2-(3,4-dichloro-phenyl)-acetyl]-methyl-amino}-2-pyrrolidin-1-yl-ethyl)-phenyl]-succinamic acid | CHEMBL138547
TypeSmall organic molecule
Emp. Form.C25H30Cl2N4O4
Mol. Mass.521.436
SMILESCN([C@H](CN1CCCC1)c1cccc(NC(=O)[C@@H](N)CC(O)=O)c1)C(=O)Cc1ccc(Cl)c(Cl)c1