Reaction Details
TargetCannabinoid receptor 1
LigandBDBM50054465
Substrate/Competitorn/a
Meas. Tech.ChEMBL_46807 (CHEMBL659694)
Ki 363±n/a nM
Citation Khanolkar, ADAbadji, VLin, SHill, WATaha, GAbouzid, KMeng, ZFan, PMakriyannis, A Head group analogs of arachidonylethanolamide, the endogenous cannabinoid ligand. J Med Chem39:4515-9 (1996) 
 
Cannabinoid receptor 1
Name:Cannabinoid receptor 1
Type:G Protein-Coupled Receptor (GPCR)
Mol. Mass.:52856.55
Organism:Rattus norvegicus (rat)
Description:P20272
Residue:473
BDBM50054465
NameBDBM50054465
Synonyms:(5Z,8Z,11Z,14Z)-Icosa-5,8,11,14-tetraenoic acid (2-hydroxy-1-hydroxymethyl-ethyl)-amide | CHEMBL141463
TypeSmall organic molecule
Emp. Form.C23H39NO3
Mol. Mass.377.5607
SMILESCCCCC\C=C/C\C=C/C\C=C/C\C=C/CCCC(=O)NC(CO)CO