Reaction Details
TargetCannabinoid receptor 1
LigandBDBM50054471
Substrate/Competitorn/a
Meas. Tech.ChEMBL_46807 (CHEMBL659694)
Ki 1760±n/a nM
Citation Khanolkar, ADAbadji, VLin, SHill, WATaha, GAbouzid, KMeng, ZFan, PMakriyannis, A Head group analogs of arachidonylethanolamide, the endogenous cannabinoid ligand. J Med Chem39:4515-9 (1996) 
 
Cannabinoid receptor 1
Name:Cannabinoid receptor 1
Type:G Protein-Coupled Receptor (GPCR)
Mol. Mass.:52856.55
Organism:Rattus norvegicus (rat)
Description:P20272
Residue:473
BDBM50054471
NameBDBM50054471
Synonyms:(5Z,8Z)-Icosa-5,8,11,14-tetraenoic acid (4-hydroxy-phenyl)-amide (5Z,8Z,11Z,14Z)-N-(4-hydroxyphenyl)icosa-5,8,11,14-tetraenamide AM-404 CHEMBL39878 N-(4-hydroxyphenyl)-(5Z,8Z,11Z,14Z)-icosatetra-5,8,11,14-enamide cid_6604822
TypeSmall organic molecule
Emp. Form.C26H37NO2
Mol. Mass.395.5775
SMILESCCCCC\C=C/C\C=C/C\C=C/C\C=C/CCCC(=O)Nc1ccc(O)cc1