Reaction Details
TargetCannabinoid receptor 2
LigandBDBM22988
Substrate/Competitorn/a
Meas. Tech.ChEMBL_47001 (CHEMBL658970)
Ki 1926±n/a nM
Citation Khanolkar, ADAbadji, VLin, SHill, WATaha, GAbouzid, KMeng, ZFan, PMakriyannis, A Head group analogs of arachidonylethanolamide, the endogenous cannabinoid ligand. J Med Chem39:4515-9 (1996) 
 
Cannabinoid receptor 2
Name:Cannabinoid receptor 2
Type:Enzyme Catalytic Domain
Mol. Mass.:38220.43
Organism:MOUSE
Description:P47936
Residue:347
BDBM22988
NameBDBM22988
Synonyms:(5Z,8Z,11Z,14Z)-N-(2-hydroxyethyl)icosa-5,8,11,14-tetraenamide ANANDAMIDE Arachidonoyl ethanolamide (AEA) Arachidonylethanolamide [14C]Anandamide | [3H]Anandamide
Typeradiolabeled substrate
Emp. Form.C22H37NO2
Mol. Mass.347.5347
SMILESCCCCC\C=C/C\C=C/C\C=C/C\C=C/CCCC(=O)NCCO