Reaction Details
TargetSodium-dependent serotonin transporter
LigandBDBM50032379
Substrate/Competitorn/a
Meas. Tech.ChEMBL_201810 (CHEMBL806804)
Ki 8.5±n/a nM
Citation Shuto, SOno, SHase, YUeno, YNoguchi, TYoshii, KMatsuda, A Synthesis and biological activity of conformationally restricted analogs of milnacipran: (1S,2R)-1-phenyl-2-[(S)-1-aminopropyl]-N,N-diethylcyclopropanecarboxami de, an efficient noncompetitive N-methyl-D-aspartic acid receptor antagonist. J Med Chem39:4844-52 (1997) 
 
Sodium-dependent serotonin transporter
Name:Sodium-dependent serotonin transporter
Type:Multi-pass membrane protein
Mol. Mass.:70168.43
Organism:Rattus norvegicus (rat)
Description:P31652
Residue:630
BDBM50032379
NameBDBM50032379
Synonyms:(1S,2R)-2-(aminomethyl)-N,N-diethyl-1-phenylcyclopropanecarboxamide CHEMBL99946 | LEVOMILNACIPRAN
TypeSmall organic molecule
Emp. Form.C15H22N2O
Mol. Mass.246.348
SMILESCCN(CC)C(=O)[C@]1(C[C@H]1CN)c1ccccc1