Reaction Details
TargetIntegrin alpha-IIb/beta-3
LigandBDBM50054828
Substrate/Competitorn/a
Meas. Tech.ChEMBL_30116 (CHEMBL642043)
Ki 90±n/a nM
Citation Samanen, JMAli, FEBarton, LSBondinell, WEBurgess, JLCallahan, JFCalvo, RRChen, WChen, LErhard, KFeuerstein, GHeys, RHwang, SMJakas, DRKeenan, RMKu, TWKwon, CLee, CPMiller, WHNewlander, KANichols, AParker, MPeishoff, CERhodes, GRoss, SShu, ASimpson, RTakata, DYellin, TOUzsinskas, IVenslavsky, JWYuan, CKHuffman, WF Potent, selective, orally active 3-oxo-1,4-benzodiazepine GPIIb/IIIa integrin antagonists. J Med Chem39:4867-70 (1997) 
 
Integrin alpha-IIb/beta-3
Name:Integrin alpha-IIb/beta-3
Synonyms:Glycoprotein IIb/IIIa
Type:n/a
Mol. Mass.:n/a
Description:ASSAY_ID of EBI is 30109
Components:This complex has 2 components.
Component 1
Name:Integrin beta-3
Type:Protein
Mol. Mass.:87038.91
Organism:Homo sapiens (Human)
Description:P05106
Residue:788
Component 2
Name:Integrin alpha-IIb
Synonyms:CD_antigen=CD41 GPIIb Glycoprotein IIb ITGA2B Integrin alpha-IIb heavy chain Integrin alpha-IIb light chain, form 2 Integrin alpha-V/beta-3 and alpha-IIb/beta 3 | Platelet membrane glycoprotein IIb
Type:Protein
Mol. Mass.:113354.85
Organism:Homo sapiens (Human)
Description:P08514
Residue:1039
BDBM50054828
NameBDBM50054828
Synonyms:CHEMBL143394 | {7-[(3-Carbamimidoyl-phenyl)-methyl-carbamoyl]-3-oxo-4-phenethyl-2,3,4,5-tetrahydro-1H-benzo[e][1,4]diazepin-2-yl}-acetic acid
TypeSmall organic molecule
Emp. Form.C28H29N5O4
Mol. Mass.499.561
SMILESCN(C(=O)c1ccc2NC(CC(O)=O)C(=O)N(CCc3ccccc3)Cc2c1)c1cccc(c1)C(N)=N