Reaction Details
Target5-hydroxytryptamine receptor 1B
LigandBDBM50054979
Substrate/Competitorn/a
Meas. Tech.ChEMBL_1353 (CHEMBL616538)
Ki 0.260000±n/a nM
Citation Halazy, SPerez, MFourrier, CPallard, IPauwels, PJPalmier, CJohn, GWValentin, JPBonnafous, RMartinez, J Serotonin dimers: application of the bivalent ligand approach to the design of new potent and selective 5-HT(1B/1D) agonists. J Med Chem39:4920-7 (1997) 
 
5-hydroxytryptamine receptor 1B
Name:5-hydroxytryptamine receptor 1B
Type:G Protein-Coupled Receptor (GPCR)
Mol. Mass.:43579.17
Organism:Homo sapiens (Human)
Description:Receptor binding assays were performed using human clone stably expressed in CHO cells
Residue:390
BDBM50054979
NameBDBM50054979
Synonyms:2-{5-[2-(4-{2-[3-(2-Amino-ethyl)-1H-indol-5-yloxy]-ethyl}-piperazin-1-yl)-ethoxy]-1H-indol-3-yl}-ethylamine | CHEMBL144128
TypeSmall organic molecule
Emp. Form.C28H38N6O2
Mol. Mass.490.6403
SMILESNCCc1c[nH]c2ccc(OCCN3CCN(CCOc4ccc5[nH]cc(CCN)c5c4)CC3)cc12