Reaction Details
TargetGenome polyprotein
LigandBDBM50055218
Substrate/Competitorn/a
Meas. Tech.ChEMBL_393 (CHEMBL615643)
Ki 4±n/a nM
Citation Webber, SETikhe, JWorland, STFuhrman, SAHendrickson, TFMatthews, DALove, RAPatick, AKMeador, JWFerre, RABrown, ELDeLisle, DMFord, CEBinford, SL Design, synthesis, and evaluation of nonpeptidic inhibitors of human rhinovirus 3C protease. J Med Chem39:5072-82 (1997) 
 
Genome polyprotein
Name:Genome polyprotein
Type:PROTEIN
Mol. Mass.:44361.04
Organism:Human rhinovirus B
Description:ChEMBL_158953
Residue:401
BDBM50055218
NameBDBM50055218
Synonyms:1-(2-naphthlmethyl) isatin-5-carboxamide CHEMBL358279 med.21724, Compound 108
TypeSmall organic molecule
Emp. Form.C20H14N2O3
Mol. Mass.330.3368
SMILESNC(=O)c1ccc2N(Cc3ccc4ccccc4c3)C(=O)C(=O)c2c1