Reaction Details
TargetGenome polyprotein
LigandBDBM50055213
Substrate/Competitorn/a
Meas. Tech.ChEMBL_393 (CHEMBL615643)
Ki 4±n/a nM
Citation Webber, SETikhe, JWorland, STFuhrman, SAHendrickson, TFMatthews, DALove, RAPatick, AKMeador, JWFerre, RABrown, ELDeLisle, DMFord, CEBinford, SL Design, synthesis, and evaluation of nonpeptidic inhibitors of human rhinovirus 3C protease. J Med Chem39:5072-82 (1997) 
 
Genome polyprotein
Name:Genome polyprotein
Type:PROTEIN
Mol. Mass.:44361.04
Organism:Human rhinovirus B
Description:ChEMBL_158953
Residue:401
BDBM50055213
NameBDBM50055213
Synonyms:1-(3,5-Dihydroxy-benzyl)-2,3-dioxo-2,3-dihydro-1H-indole-5-carboxylic acid amide | CHEMBL145833
TypeSmall organic molecule
Emp. Form.C16H12N2O5
Mol. Mass.312.2769
SMILESNC(=O)c1ccc2N(Cc3cc(O)cc(O)c3)C(=O)C(=O)c2c1