Reaction Details
TargetPhospholipase A2, membrane associated
LigandBDBM50055387
Substrate/Competitorn/a
Meas. Tech.ChEMBL_156189 (CHEMBL761440)
IC50 11±n/a nM
Citation Draheim, SEBach, NJDillard, RDBerry, DRCarlson, DGChirgadze, NYClawson, DKHartley, LWJohnson, LMJones, NDMcKinney, ERMihelich, EDOlkowski, JLSchevitz, RWSmith, ACSnyder, DWSommers, CDWery, JP Indole inhibitors of human nonpancreatic secretory phospholipase A2. 3. Indole-3-glyoxamides. J Med Chem39:5159-75 (1997) 
 
Phospholipase A2, membrane associated
Name:Phospholipase A2, membrane associated
Type:Hydrolase
Mol. Mass.:16101.20
Organism:Homo sapiens (Human)
Description:The human nps PLA2 was cloned, and expressed in E. coli. There was a refolding process in the purification.
Residue:144
BDBM50055387
NameBDBM50055387
Synonyms:(R)-2-(3-Aminooxalyl-1-benzyl-2-methyl-1H-indol-4-yloxy)-propionic acid | CHEMBL359005
TypeSmall organic molecule
Emp. Form.C21H20N2O5
Mol. Mass.380.3939
SMILESC[C@@H](Oc1cccc2n(Cc3ccccc3)c(C)c(C(=O)C(N)=O)c12)C(O)=O