Reaction Details
TargetPhospholipase A2, membrane associated
LigandBDBM50055371
Substrate/Competitorn/a
Meas. Tech.ChEMBL_156189 (CHEMBL761440)
IC50 6±n/a nM
Citation Draheim, SEBach, NJDillard, RDBerry, DRCarlson, DGChirgadze, NYClawson, DKHartley, LWJohnson, LMJones, NDMcKinney, ERMihelich, EDOlkowski, JLSchevitz, RWSmith, ACSnyder, DWSommers, CDWery, JP Indole inhibitors of human nonpancreatic secretory phospholipase A2. 3. Indole-3-glyoxamides. J Med Chem39:5159-75 (1997) 
 
Phospholipase A2, membrane associated
Name:Phospholipase A2, membrane associated
Type:Hydrolase
Mol. Mass.:16101.20
Organism:Homo sapiens (Human)
Description:The human nps PLA2 was cloned, and expressed in E. coli. There was a refolding process in the purification.
Residue:144
BDBM50055371
NameBDBM50055371
Synonyms:(3-aminooxalyl-1-biphenyl-2-ylmethyl-2-methyl-1H-indol-4-yloxy)-acetic acid | CHEMBL357979
TypeSmall organic molecule
Emp. Form.C26H22N2O5
Mol. Mass.442.4633
SMILESCc1c(C(=O)C(N)=O)c2c(OCC(O)=O)cccc2n1Cc1ccccc1-c1ccccc1