Reaction Details
TargetPhospholipase A2, major isoenzyme
LigandBDBM50055383
Substrate/Competitorn/a
Meas. Tech.ChEMBL_156352 (CHEMBL761682)
IC50 15±n/a nM
Citation Draheim, SEBach, NJDillard, RDBerry, DRCarlson, DGChirgadze, NYClawson, DKHartley, LWJohnson, LMJones, NDMcKinney, ERMihelich, EDOlkowski, JLSchevitz, RWSmith, ACSnyder, DWSommers, CDWery, JP Indole inhibitors of human nonpancreatic secretory phospholipase A2. 3. Indole-3-glyoxamides. J Med Chem39:5159-75 (1997) 
 
Phospholipase A2, major isoenzyme
Name:Phospholipase A2, major isoenzyme
Type:Hydrolase; monomer or homodimer
Mol. Mass.:16279.83
Organism:Sus scrofa (pig)
Description:Purchased from Sigma.
Residue:146
BDBM50055383
NameBDBM50055383
Synonyms:(3-Aminooxalyl-1-benzyl-2-methyl-1H-indol-4-yloxy)-acetic acid CHEMBL346196
TypeSmall organic molecule
Emp. Form.C20H18N2O5
Mol. Mass.366.3673
SMILESCc1c(C(=O)C(N)=O)c2c(OCC(O)=O)cccc2n1Cc1ccccc1