Reaction Details
TargetReverse transcriptase/RNaseH
LigandBDBM50055474
Substrate/Competitorn/a
Meas. Tech.ChEMBL_195079 (CHEMBL797533)
IC50 3400±n/a nM
Citation Genin, MJPoel, TJYagi, YBiles, CAlthaus, IKeiser, BJKopta, LAFriis, JMReusser, FAdams, WJOlmsted, RAVoorman, RLThomas, RCRomero, DL Synthesis and bioactivity of novel bis(heteroaryl)piperazine (BHAP) reverse transcriptase inhibitors: structure-activity relationships and increased metabolic stability of novel substituted pyridine analogs. J Med Chem39:5267-75 (1997) 
 
Reverse transcriptase/RNaseH
Name:Reverse transcriptase/RNaseH
Type:PROTEIN
Mol. Mass.:65229.15
Organism:Human immunodeficiency virus 1
Description:ChEMBL_1473730
Residue:566
BDBM50055474
NameBDBM50055474
Synonyms:CHEMBL151316 | N-(2-{4-[(3-Ethoxy-pyridin-2-yl)-methyl-amino]-piperidine-1-carbonyl}-1H-indol-5-yl)-methanesulfonamide
TypeSmall organic molecule
Emp. Form.C23H29N5O4S
Mol. Mass.471.572
SMILESCCOc1cccnc1N(C)C1CCN(CC1)C(=O)c1cc2cc(NS(C)(=O)=O)ccc2[nH]1