Reaction Details
TargetReverse transcriptase/RNaseH
LigandBDBM50055471
Substrate/Competitorn/a
Meas. Tech.ChEMBL_195079 (CHEMBL797533)
IC50 1100±n/a nM
Citation Genin, MJPoel, TJYagi, YBiles, CAlthaus, IKeiser, BJKopta, LAFriis, JMReusser, FAdams, WJOlmsted, RAVoorman, RLThomas, RCRomero, DL Synthesis and bioactivity of novel bis(heteroaryl)piperazine (BHAP) reverse transcriptase inhibitors: structure-activity relationships and increased metabolic stability of novel substituted pyridine analogs. J Med Chem39:5267-75 (1997) 
 
Reverse transcriptase/RNaseH
Name:Reverse transcriptase/RNaseH
Type:PROTEIN
Mol. Mass.:65229.15
Organism:Human immunodeficiency virus 1
Description:ChEMBL_1473730
Residue:566
BDBM50055471
NameBDBM50055471
Synonyms:CHEMBL149055 | N-{2-[4-(3-Isopropoxy-pyridin-2-yl)-piperazine-1-carbonyl]-1H-indol-5-yl}-methanesulfonamide
TypeSmall organic molecule
Emp. Form.C22H27N5O4S
Mol. Mass.457.546
SMILESCC(C)Oc1cccnc1N1CCN(CC1)C(=O)c1cc2cc(NS(C)(=O)=O)ccc2[nH]1