Reaction Details
TargetGag-Pol polyprotein [489-587]
LigandBDBM520
Substrate/Competitorn/a
Meas. Tech.ChEMBL_157575 (CHEMBL763326)
Ki 0.37±n/a nM
Citation Jadhav, PKAla, PWoerner, FJChang, CHGarber, SSAnton, EDBacheler, LT Cyclic urea amides: HIV-1 protease inhibitors with low nanomolar potency against both wild type and protease inhibitor resistant mutants of HIV. J Med Chem40:181-91 (1997) 
 
Gag-Pol polyprotein [489-587]
Name:Gag-Pol polyprotein [489-587]
Type:Enzyme Subunit
Mol. Mass.:10781.16
Organism:Human immunodeficiency virus type 1
Description:P04585[489-587]
Residue:99
BDBM520
NameBDBM520
Synonyms:1,3-thiazol-5-ylmethyl N-[(2S,3S,5S)-3-hydroxy-5-[(2S)-3-methyl-2-{[methyl({[2-(propan-2-yl)-1,3-thiazol-4-yl]methyl})carbamoyl]amino}butanamido]-1,6-diphenylhexan-2-yl]carbamate CHEMBL163 RTV | Ritonavir
TypeSmall organic molecule
Emp. Form.C37H48N6O5S2
Mol. Mass.720.944
SMILESCC(C)[C@H](NC(=O)N(C)Cc1csc(n1)C(C)C)C(=O)N[C@H](C[C@H](O)[C@H](Cc1ccccc1)NC(=O)OCc1cncs1)Cc1ccccc1