Reaction Details
TargetProtein kinase C eta type
LigandBDBM3150
Substrate/Competitorn/a
Meas. Tech.ChEMBL_161125 (CHEMBL770096)
IC50 60±n/a nM
Citation Lai, YSMendoza, JSJagdmann, GEMenaldino, DSBiggers, CKHeerding, JMWilson, JWHall, SEJiang, JBJanzen, WPBallas, LM Synthesis and protein kinase C inhibitory activities of balanol analogs with replacement of the perhydroazepine moiety. J Med Chem40:226-35 (1997) 
 
Protein kinase C eta type
Name:Protein kinase C eta type
Type:Enzyme
Mol. Mass.:77844.26
Organism:Homo sapiens (Human)
Description:The recombinant human PKC enzymes were produced using a baculovirus expression system in SF9 cells
Residue:683
BDBM3150
NameBDBM3150
Synonyms:2-{[2,6-dihydroxy-4-({[(1R,2R)-2-[(4-hydroxybenzene)amido]cycloheptyl]oxy}carbonyl)phenyl]carbonyl}-3-hydroxybenzoic acid CHEMBL304549
TypeSmall organic molecule
Emp. Form.C29H27NO10
Mol. Mass.549.5254
SMILESOC(=O)c1cccc(O)c1C(=O)c1c(O)cc(cc1O)C(=O)O[C@@H]1CCCCC[C@H]1NC(=O)c1ccc(O)cc1