Reaction Details
TargetProtein kinase C epsilon type
LigandBDBM3151
Substrate/Competitorn/a
Meas. Tech.ChEMBL_160957 (CHEMBL769119)
IC50 1800±n/a nM
Citation Lai, YSMendoza, JSJagdmann, GEMenaldino, DSBiggers, CKHeerding, JMWilson, JWHall, SEJiang, JBJanzen, WPBallas, LM Synthesis and protein kinase C inhibitory activities of balanol analogs with replacement of the perhydroazepine moiety. J Med Chem40:226-35 (1997) 
 
Protein kinase C epsilon type
Name:Protein kinase C epsilon type
Type:Enzyme
Mol. Mass.:83680.45
Organism:Homo sapiens (Human)
Description:The recombinant human PKC enzymes were produced using a baculovirus expression system in SF9 cells
Residue:737
BDBM3151
NameBDBM3151
Synonyms:2-{[2,6-dihydroxy-4-({[(3R,4R)-3-[(4-hydroxybenzene)amido]piperidin-4-yl]oxy}carbonyl)phenyl]carbonyl}-3-hydroxybenzoic acid CHEMBL67442
TypeSmall organic molecule
Emp. Form.C27H24N2O10
Mol. Mass.536.4869
SMILESOC(=O)c1cccc(O)c1C(=O)c1c(O)cc(cc1O)C(=O)O[C@@H]1CCNC[C@H]1NC(=O)c1ccc(O)cc1